{"text_format":"1","workbook":"xlsx","n_sheets":8,"sheets":["Full Offense Macros","Open Offense Macros","CountyCompletenessReport Macro","Transaction Error Reports","NICS Reports","Late Dispositions","Version Info","County List"],"not_rendered":{"charts":0,"images":0,"macros":1,"external_links":0,"defined_names":1,"comments":0,"pivot_tables":0},"unopened":[],"bounds":{"document_bytes":16777216,"sheet_cells":100000,"rows_first":2000,"rows_last":500,"rows_between":2000,"halvings":0,"cell_chars":16384,"cell_head_chars":4096},"cells_cut":0,"cells_raw":0,"read":"whole","date_system":"1900"}

{"sheet":"Full Offense Macros","index":0,"n_rows":38,"n_cols":26,"rows_kept":38,"cut":false,"hidden":false,"merged":[[35,2,37,5],[35,6,37,9],[35,10,37,13],[35,14,37,17],[29,2,31,5],[29,6,31,9],[29,10,31,13],[29,14,31,17],[34,2,34,4],[34,6,34,8],[34,10,34,12],[34,14,34,16],[22,14,22,16],[28,14,28,16],[28,10,28,12],[22,2,22,4],[28,2,28,4],[22,6,22,8],[28,6,28,8],[22,10,22,12],[23,2,25,5],[23,6,25,9],[23,10,25,13],[23,14,25,17]]}
["Report Used:   Full County Open and Closed Offense Report",null,null,null,null,null,null,null,null,null,null,null,null,null,null,null,null,null,null,null,null,null,null,null,null,"File Type Saved As?"]
[null,null,null,null,null,null,null,null,null,null,null,null,null,null,null,null,null,null,null,null,null,null,null,null,null,"csv"]
[]
[]
[]
[]
[]
[]
[]
[]
[]
[]
[]
[]
[]
[]
[]
[]
[]
[]
[]
[null,"Specific CDN/PAN/JAN Code Request:"," You can select up to 8 additionals codes"]
[null,"Are you looking for a specific ","CDN/PAN/JAN 1",null,null,null,"CDN/PAN/JAN 2",null,null,null,"CDN/PAN/JAN 3",null,null,null,"CDN/PAN/JAN 4"]
[null,"code that is not included in "]
[null,"the macro?  Enter the CDN/PAN/JAN"]
[null,"here to include it in the results"]
[]
[null,"NOTE:  This will not work with CPN/JDN codes."]
[null,null,"CDN/PAN/JAN 5",null,null,null,"CDN/PAN/JAN 6",null,null,null,"CDN/PAN/JAN 7",null,null,null,"CDN/PAN/JAN 8"]
[]
[]
[]
[]
[]
[null,null,"Offense Code 1",null,null,null,"Offense Code 2",null,null,null,"Offense Code 3",null,null,null,"Offense Code 4"]
[null,"Looking for a specific offene code?"]
[null,"You can enter up to 4 offense codes here"]
[null,"The last 4 tabs will only have these offenses"]

{"sheet":"Open Offense Macros","index":1,"n_rows":6,"n_cols":26,"rows_kept":6,"cut":false,"hidden":false,"merged":[]}
["Report Used:   Open Offense Report",null,null,null,null,null,null,null,null,null,null,null,null,null,null,null,null,null,null,null,null,null,null,null,null,"File Type Saved As?"]
[null,null,null,null,null,null,null,null,null,null,null,null,null,null,null,null,null,null,null,null,null,null,null,null,null,"csv"]
[null,null,null,null,null,null,null,null,null,null,null,null,null,null,null,null,null,null,1,null,null,null,"Hide"]
[]
[]
[null,null,null,null,null,null,null,null,null,null,null,null,null,null,null,null,null,null,null,null,null,null,"Show"]

{"sheet":"CountyCompletenessReport Macro","index":2,"n_rows":2,"n_cols":26,"rows_kept":2,"cut":false,"hidden":true,"merged":[]}
["Report Used:   County Completeness Report",null,null,null,null,null,null,null,null,null,null,null,null,null,null,null,null,null,null,null,null,null,null,null,null,"File Type Saved As?"]
[null,null,null,null,null,null,null,null,null,null,null,null,null,null,null,null,null,null,null,null,null,null,null,null,null,"csv"]

{"sheet":"Transaction Error Reports","index":3,"n_rows":8,"n_cols":26,"rows_kept":8,"cut":false,"hidden":true,"merged":[]}
["Report Used:   Prosecutor Transaction Error Report",null,null,null,null,null,null,null,null,null,null,null,null,null,null,null,null,null,null,null,null,null,null,null,null,"File Type Saved As?"]
["Report Used:   Court Transaction Error Report",null,null,null,null,null,null,null,null,null,null,null,null,null,null,null,null,null,null,null,null,null,null,null,null,"csv"]
[]
[]
[]
[]
[]
[null,null,null,null,null,null,null,null,null,null,null,null,null,null," "]

{"sheet":"NICS Reports","index":4,"n_rows":40,"n_cols":28,"rows_kept":40,"cut":false,"hidden":true,"merged":[[0,1,3,6],[1,27,3,27],[6,27,10,27],[2,8,2,12],[4,8,4,12],[1,23,10,23],[1,26,12,26],[12,24,32,24],[1,25,7,25],[10,25,17,25],[1,24,3,24],[20,25,26,25],[1,13,2,16]]}
[null,"Report Used:   Legacy NIE County - Transaction",null,null,null,null,null,null,null,null,null,null,null,null,null,null,null,null,null,null,null,null,null,"MsgPartOne","MsgPartTwo","MsgZeroReport","MsgEnd","messagebox1"]
[null,null,null,null,null,null,null,null,null,null,null,null,null,"Number of days for agency to reply\nUsed in email message",null,null,null,null,null,null,null,null,null,"DPS is conducting a biennial audit of all agencies that submit NICS records to the FBI NICS Indices.  Attached is a list of records that were entered into the NICS Indices for these ORIs in the county during","Please return the supporting documentation for the listed NICS entries to me at","The ORIs below did not enter any NICS records or any Zero Reports for the year","If you have any questions, please let me know.\nThank you,\nCJIS Site Support Specialist\n","Do you want to open up an email message to send?"]
[null,null,null,null,null,null,null,null,"NICS Audit Reports"]
[null,null,null,null,null,null,null,null,null,"Year",2018,null,null,null,30,"Days"]
[null,null,null,null,null,null,null,null,"(Change to year you are auditing)",null,null,null,null,null,{"$f":"TEXT(TODAY()+O4,\"MM/DD/YYYY\")","v":"02/20/2022"},null,null,null,null,null,null,null,null,null,"MsgPartTwoDate"]
[null,null,null,null,null,null,null,null,null,null,null,null,null,null,null,null,null,null,null,null,null,null,null,null,{"$f":"CONCATENATE(\"by \",TEXT(TODAY()+O4,\"MM/DD/YYYY\"),\".\")","v":"by 02/20/2022."},null,null,"messagebox2"]
[null,null,null,null,null,null,null,null,null,null,null,null,null,null,null,null,null,null,null,null,null,null,null,null,null,null,null,"You will be given an opportunity to add additional email addresses when done"]
[null,null,null,null,null,null,null,null,null,null,null,null,null,null,null,null,null,null,null,null,null,null,null,null,"Number of days for agency to reply"]
[]
[null,null,null,null,null,null,null,null,null,null,null,null,null,null,null,null,null,null,null,null,null,null,null,null,null,"MsgZeroReportRest"]
[null,null,null,null,null,null,null,null,null,null,null,null,null,null,null,null,null,null,null,null,null,null,null,null,null,"Please verify if these agencies do not hear and do not report NICS case information.  Please send the NICS contact information for these agencies."]
[null,null,null,null,null,null,null,null,null,null,null,null,null,null,null,null,null,null,null,null,null,null,null,null,"MsgPartTwoRest"]
[null,null,null,null,null,null,null,null,null,null,null,null,null,null,null,null,null,null,null,null,null,null,null,null,"These documents can be sent to DPS per Texas Government Code 411.0521(b)(4).  The document(s) needed are copies of the signed court order for involuntary commitment of the person to a facility, the dismissal/delay of the criminal case due to mental incapacity reasons, or for the adult guardianship.  If your agency is reporting Misdemeanor Class C Family Violence cases, send a copy of the conviction paperwork.  The supporting court documentation that is submitted to DPS will be deleted and/or destroyed upon completion of the biennial audit."]
[]
[null,null,null,null,null,null,null,null,null,null,null,null,null,null,null,null,null,null,null,null,null,null,null,null,null,null,null,"NoORI"]
[null,null,null,null,null,null,null,null,null,null,null,null,null,null,null,null,null,null,null,null,null,null,null,null,null,null,null,"There were no NICS entries done this audit year"]
[]
[]
[]
[null,null,null,null,null,null,null,null,null,null,null,null,null,null,null,null,null,null,null,null,null,null,null,null,null,"Original - bring back up if I add Zero Report ORI's to email"]
[null,null,null,null,null,null,null,null,null,null,null,null,null,null,null,null,null,null,null,null,null,null,null,null,null,"ORIs listed below did not enter any NICS records or any Zero Reports for the year"]
[]
[]
[]
[]
[]
[]
[]
[]
[null,null,null,null,null,null,null,null,null,"AuditColumnNumber"]
[null,null,null,null,null,null,null,null,null,"Column",5]
[null,null,null,null,null,null,null,null,null,"Which column number is the year being audited?"]
[]
[null,null,null,null,null,null,null,null,null,"A=1"]
[null,null,null,null,null,null,null,null,null,"B=2"]
[null,null,null,null,null,null,null,null,null,"C=3"]
[null,null,null,null,null,null,null,null,null,"D=4"]
[null,null,null,null,null,null,null,null,null,"E=5"]
[null,null,null,null,null,null,null,null,null,"F=6"]
[null,null,null,null,null,null,null,null,null,"etc"]

{"sheet":"Late Dispositions","index":5,"n_rows":11,"n_cols":26,"rows_kept":11,"cut":false,"hidden":true,"merged":[]}
["Report Used:   County Dispositions over 37 Days Old - Adhoc",null,null,null,null,null,null,null,null,null,null,null,null,null,null,null,null,null,null,null,null,null,null,null,null,"File Type Saved As?"]
["Change file type if needed in Cell Z2",null,null,null,null,null,null,null,null,null,null,null,null,null,null,null,null,null,null,null,null,null,null,null,null,"xlsx"]
[]
[]
[null,null,null,"Late Disposition Year to compare"]
[null,null,null,2021]
[null,null,null,"Late Disposition number of days to compare"]
[null,null,null,35]
[]
[null,null,null,"Enter Column Letter for the DOE column"]
[null,null,null,"X"]

{"sheet":"Version Info","index":6,"n_rows":127,"n_cols":31,"rows_kept":127,"cut":false,"hidden":true,"merged":[]}
["VERSION 20181101",null,null,null,null,null,null,null,null,null,"Maximum Number of Rows allowed",null,null,null,null,null,null,null,"Hide Warning Notification Counter","All Versions",null,null,null,null,null,"File Types",null,null,null,"Column Letter","Column Number"]
[null,"Beginning of a new macro that can pull the following data from a",null,null,null,null,null,null,null,null,1048575,null,null,null,null,null,null,null,"How many runs to hide for:",50,null,null,null,null,null,"csv",null,null,null,"A",1]
[null," Full Open and Closed Offense Report",null,null,null,null,null,null,null,null,"Maximum Number of Files allowed",null,null,null,null,null,null,null,"Current number of macro runs",45,null,null,null,null,null,"xls",null,null,null,"B",2]
[null,null,null,null,null,null,null,null,null,null,50,null,600,null,null,null,null,null,"Yes/No on formWARNING","Yes",null,null,null,null,null,"xlsx",null,null,null,"C",3]
[null," Felony - Arrest Only",null,null,null,null,null,null,null,null,null,null,null,null,null,null,null,null,null,null,null,null,null,null,null,null,null,null,null,"D",4]
[null," Misd - Arrest Only",null,null,null,null,null,null,null,null,null,null,null,null,null,null,null,null,null,null,null,null,null,null,null,null,null,null,null,"E",5]
[null," Felony - Pros/Court Opened",null,null,null,null,null,null,null,null,"Late Disposition Year to compare",null,null,null,null,null,null,null,null,null,null,null,null,null,null,null,null,null,null,"F",6]
[null," Misd - Pros/Court Opened",null,null,null,null,null,null,null,null,{"$f":"'Late Dispositions'!D6","v":2021},null,null,null,null,null,null,null,null,null,null,null,null,null,null,null,null,null,null,"G",7]
[null," Juvenile same as above",null,null,null,null,null,null,null,null,"Late Disposition number of days",null,null,null,null,null,null,null,null,null,null,null,null,null,null,null,null,null,null,"H",8]
[null," Juvenile Last Dispo received (closed but not complete)",null,null,null,null,null,null,null,null,{"$f":"'Late Dispositions'!D8","v":35},null,null,null,null,null,null,null,null,null,null,null,null,null,"Report","File Type Saved As?",null,null,null,"I",9]
[null," Name Based Disposition",null,null,null,null,null,null,null,null,"Late Disposition DOE Column Number",null,null,null,null,null,null,null,null,null,null,null,null,null,"Late Dispositions",{"$f":"'Late Dispositions'!$Z$2","v":"xlsx"},null,null,null,"J",10]
[null,null,null,null,null,null,null,null,null,null,{"$f":"VLOOKUP('Late Dispositions'!D11,'Version Info'!AD2:AE27,2)","v":24},null,null,null,null,null,null,null,null,null,null,null,null,null,"Open Offense",{"$f":"'Full Offense Macros'!$Z$2","v":"csv"},null,null,null,"K",11]
[" VERSION 20181105",null,null,null,null,null,null,null,null,null,null,null,null,null,null,null,null,null,null,null,null,null,null,null,"Full Open/Closed",{"$f":"'Open Offense Macros'!$Z$2","v":"csv"},null,null,null,"L",12]
[null," Fixed minor bugs",null,null,null,null,null,null,null,null,null,null,null,null,null,null,null,null,null,null,null,null,null,null,"Completeness",{"$f":"'CountyCompletenessReport Macro'!$Z$2","v":"csv"},null,null,null,"M",13]
[null," Changed Macro Name",null,null,null,null,null,null,null,null,null,null,null,null,null,null,null,null,null,null,null,null,null,null,"ER3/ER4 Errors",{"$f":"'Transaction Error Reports'!$Z$2","v":"csv"},null,null,null,"N",14]
[null," Added Open Offense Report by Level and Degree using the Full Open and Closed Offense Report",null,null,null,null,null,null,null,null,null,null,null,null,null,null,null,null,null,null,null,null,null,null,null,null,null,null,null,"O",15]
[null," Added Open Offense Report Macro using the Open Offense Report (Old version)",null,null,null,null,null,null,null,null,null,null,null,null,null,null,null,null,null,null,null,null,null,null,null,null,null,null,null,"P",16]
[null,null,null,null,null,null,null,null,null,null,null,null,null,null,null,null,null,null,null,null,null,null,null,null,null,null,null,null,null,"Q",17]
[" VERSION 20181114",null,null,null,null,null,null,null,null,null,null,null,null,null,null,null,null,null,null,null,null,null,null,null,null,null,null,null,null,"R",18]
[null," Fixed bug that would cause wrong range to be copied.",null,null,null,null,null,null,null,null,null,null,null,null,null,null,null,null,null,null,null,null,null,null,null,null,null,null,null,"S",19]
[null,null,null,null,null,null,null,null,null,null,null,null,null,null,null,null,null,null,null,null,null,null,null,null,null,null,null,null,null,"T",20]
[" VERSION 20190124",null,null,null,null,null,null,null,null,null,null,null,null,null,null,null,null,null,null,null,null,null,null,null,null,null,null,null,null,"U",21]
[null," Added feature for counting number of rows and attempting to prevent going over max allowed.",null,null,0,null,null,null,null,null,null,null,null,null,null,null,null,null,null,null,null,null,null,null,null,null,null,null,null,"V",22]
[null,"Moved number of rows count and files from the VBA to this sheet to make it easier to adjust in the future.",null,null,null,null,null,null,null,null,null,null,null,null,null,null,null,null,null,null,null,null,null,null,null,null,null,null,null,"W",23]
[null,null,null,null,null,null,null,null,null,null,null,null,null,null,null,null,null,null,null,null,null,null,null,null,null,null,null,null,null,"X",24]
["VERSION 20190207",null,null,null,null,null,null,null,null,null,null,null,null,null,null,null,null,null,null,null,null,null,null,null,null,null,null,null,null,"Y",25]
[null,"Clean up some code",null,null,null,null,null,null,null,null,null,null,null,null,null,null,null,null,null,null,null,null,null,null,null,null,null,null,null,"Z",26]
[null,"Added NBF to Level/Degree Report",null,null,null,null,null,null,null,null,null,null,null,null,null,null,null,null,null,null,null,null,null,null,null,null,null,null,null,"AA",27]
[null,null,null,null,null,null,null,null,null,null,null,null,null,null,null,null,null,null,null,null,null,null,null,null,null,null,null,null,null,"AB",28]
["VERSION 20190318",null,null,null,null,null,null,null,null,null,null,null,null,null,null,null,null,null,null,null,null,null,null,null,null,null,null,null,null,"AC",29]
[null,"Added Completeness Percentage Report Option",null,null,null,null,null,null,null,null,null,null,null,null,null,null,null,null,null,null,null,null,null,null,null,null,null,null,null,"AD",30]
[null,"Added Multi-Select option for all reports",null,null,null,null,null,null,null,null,null,null,null,null,null,null,null,null,null,null,null,null,null,null,null,null,null,null,null,"AE",31]
[null,"Completeness Percentage only has Multi-Select option available.",null,null,null,null,null,null,null,null,null,null,null,null,null,null,null,null,null,null,null,null,null,null,null,null,null,null,null,"AF",32]
[null,null,null,null,null,null,null,null,null,null,null,null,null,null,null,null,null,null,null,null,null,null,null,null,null,null,null,null,null,"AG",33]
[null,null,null,null,null,null,null,null,null,null,null,null,null,null,null,null,null,null,null,null,null,null,null,null,null,null,null,null,null,"AH",34]
["VERSION 20190329",null,null,null,null,null,null,null,null,null,null,null,null,null,null,null,null,null,null,null,null,null,null,null,null,null,null,null,null,"AI",35]
[null,"Added function to hide WARNING message on Multi-Select.  Prevents warning message for 50 runs or next time workbook is opened.",null,null,null,null,null,null,null,null,null,null,null,null,null,null,null,null,null,null,null,null,null,null,null,null,null,null,null,"AJ",36]
[null,"Works on both Full Open and Closed and the Open Offense macros.",null,null,null,null,null,null,null,null,null,null,null,null,null,null,null,null,null,null,null,null,null,null,null,null,null,null,null,"AK",37]
[null,"Added Transaction Error Reports",null,null,null,null,null,null,null,null,null,null,null,null,null,null,null,null,null,null,null,null,null,null,null,null,null,null,null,"AL",38]
[null,"Now counts number of files open and if over max allowed, cancels macro",null,null,null,null,null,null,null,null,null,null,null,null,null,null,null,null,null,null,null,null,null,null,null,null,null,null,null,"AM",39]
[null,"Added NICS Report",null,null,null,null,null,null,null,null,null,null,null,null,null,null,null,null,null,null,null,null,null,null,null,null,null,null,null,"AN",40]
[null,null,null,null,null,null,null,null,null,null,null,null,null,null,null,null,null,null,null,null,null,null,null,null,null,null,null,null,null,"AO",41]
["VERSION 20190501",null,null,null,null,null,null,null,null,null,null,null,null,null,null,null,null,null,null,null,null,null,null,null,null,null,null,null,null,"AP",42]
[null,"Fixed bug with ORI Checking",null,null,null,null,null,null,null,null,null,null,null,null,null,null,null,null,null,null,null,null,null,null,null,null,null,null,null,"AQ",43]
[null,null,null,null,null,null,null,null,null,null,null,null,null,null,null,null,null,null,null,null,null,null,null,null,null,null,null,null,null,"AR",44]
["VERSION 20190613",null,null,null,null,null,null,null,null,null,null,null,null,null,null,null,null,null,null,null,null,null,null,null,null,null,null,null,null,"AS",45]
[null,"Fixed print jobs for Full Open and Closed and Full Open and Closed by Level/Degree",null,null,null,null,null,null,null,null,null,null,null,null,null,null,null,null,null,null,null,null,null,null,null,null,null,null,null,"AT",46]
[null,null,null,null,null,null,null,null,null,null,null,null,null,null,null,null,null,null,null,null,null,null,null,null,null,null,null,null,null,"AU",47]
["VERSION 20190819",null,null,null,null,null,null,null,null,null,null,null,null,null,null,null,null,null,null,null,null,null,null,null,null,null,null,null,null,"AV",48]
[null,"Fixed bug that was allowing 605 to show on L/D report",null,null,null,null,null,null,null,null,null,null,null,null,null,null,null,null,null,null,null,null,null,null,null,null,null,null,null,"AW",49]
[null,"Split NBD adults into 2 tabs - one for Pros and one for Court - both Full and L/D report",null,null,null,null,null,null,null,null,null,null,null,null,null,null,null,null,null,null,null,null,null,null,null,null,null,null,null,"AX",50]
[null,"Pulled Pros actions \"E\", \"P\", \"F\" from pros open offense tab and moved to their own tabs (added 6 new tabs at end of report)",null,null,null,null,null,null,null,null,null,null,null,null,null,null,null,null,null,null,null,null,null,null,null,null,null,null,null,"AY",51]
[null,"No changes needed to accommodate new 235 dispo code",null,null,null,null,null,null,null,null,null,null,null,null,null,null,null,null,null,null,null,null,null,null,null,null,null,null,null,"AZ",52]
[null,null,null,null,null,null,null,null,null,null,null,null,null,null,null,null,null,null,null,null,null,null,null,null,null,null,null,null,null,"BA",53]
["VERSION 20190901",null,null,null,null,null,null,null,null,null,null,null,null,null,null,null,null,null,null,null,null,null,null,null,null,null,null,null,null,"BB",54]
[null,"Added breakout for Arrest, Pros and Court on L/D macro for adults and Arrest, Court for Juv ",null,null,null,null,null,null,null,null,null,null,null,null,null,null,null,null,null,null,null,null,null,null,null,null,null,null,null,"BC",55]
[null,"Moved some program to it's own module due to macro being to large for excel.  Code cleanup",null,null,null,null,null,null,null,null,null,null,null,null,null,null,null,null,null,null,null,null,null,null,null,null,null,null,null,"BD",56]
[null,"Fixed bug that was allowing the multi-select warning to show up after closing the macro",null,null,null,null,null,null,null,null,null,null,null,null,null,null,null,null,null,null,null,null,null,null,null,null,null,null,null,"BE",57]
[null,"Added new tab that puts Prosecutor Action for Felony E, F, P onto one tab and Misdemeanor onto one tab.",null,null,null,null,null,null,null,null,null,null,null,null,null,null,null,null,null,null,null,null,null,null,null,null,null,null,null,"BF",58]
[null,"Added new tab for 235 in Full macro",null,null,null,null,null,null,null,null,null,null,null,null,null,null,null,null,null,null,null,null,null,null,null,null,null,null,null,"BG",59]
{"$rows_left_out":68}
{"sheet":"County List","index":7,"n_rows":549,"n_cols":3,"rows_kept":549,"cut":false,"hidden":true,"merged":[]}
["ORI","County","Region"]
["001","ANDERSON","Region 1"]
["002","ANDREWS","Region 5"]
["003","ANGELINA","Region 1"]
["004","ARANSAS","Region 4"]
["005","ARCHER","Region 8"]
["006","ARMSTRONG","Region 9"]
["007","ATASCOSA","Region 4"]
["008","AUSTIN","Region 2"]
["009","BAILEY","Region 9"]
["010","BANDERA","Region 3"]
["011","BASTROP","Region 3"]
["012","BAYLOR","Region 6"]
["013","BEE","Region 4"]
["014","BELL","Region 7"]
["015","BEXAR","Region 3"]
["016","BLANCO","Region 3"]
["017","BORDEN","Region 6"]
["018","BOSQUE","Region 7"]
["019","BOWIE","Region 1"]
["020","BRAZORIA","Region 2"]
["021","BRAZOS","Region 2"]
["022","BREWSTER","Region 5"]
["023","BRISCOE","Region 9"]
["024","BROOKS","Region 4"]
["025","BROWN","Region 7"]
["026","BURLESON","Region 2"]
["027","BURNET","Region 3"]
["028","CALDWELL","Region 3"]
["029","CALHOUN","Region 2"]
["030","CALLAHAN","Region 7"]
["031","CAMERON","Region 4"]
["032","CAMP","Region 1"]
["033","CARSON","Region 9"]
["034","CASS","Region 1"]
["035","CASTRO","Region 9"]
["036","CHAMBERS","Region 2"]
["037","CHEROKEE","Region 1"]
["038","CHILDRESS","Region 9"]
["039","CLAY","Region 8"]
["040","COCHRAN","Region 9"]
["041","COKE","Region 6"]
["042","COLEMAN","Region 7"]
["043","COLLIN","Region 8"]
["044","COLLINGSWORTH","Region 9"]
["045","COLORADO","Region 2"]
["046","COMAL","Region 3"]
["047","COMANCHE","Region 7"]
["048","CONCHO","Region 6"]
["049","COOKE","Region 8"]
["050","CORYELL","Region 7"]
["051","COTTLE","Region 6"]
["052","CRANE","Region 5"]
["053","CROCKETT","Region 5"]
["054","CROSBY","Region 6"]
["055","CULBERSON","Region 5"]
["056","DALLAM","Region 9"]
["057","DALLAS","Region 8"]
["058","DAWSON","Region 6"]
["059","DEAF SMITH","Region 9"]
{"$rows_left_out":489}